{"text_format":"1","workbook":"xlsx","n_sheets":20,"sheets":["Instructions","Team Data","Scoring Worksheet","Score Entry And Standings","Ref Scoresheet","Module1","Module2","Module3","Module4","Module5","Module6","Module7","Module8","Module9","Module10","Module11","Module12","Module13","Module14","Module15"],"not_rendered":{"charts":0,"images":1,"macros":1,"external_links":0,"defined_names":1,"comments":0,"pivot_tables":0},"unopened":[{"sheet":"Module1","index":5,"reason":"part_missing"},{"sheet":"Module2","index":6,"reason":"part_missing"},{"sheet":"Module3","index":7,"reason":"part_missing"},{"sheet":"Module4","index":8,"reason":"part_missing"},{"sheet":"Module5","index":9,"reason":"part_missing"},{"sheet":"Module6","index":10,"reason":"part_missing"},{"sheet":"Module7","index":11,"reason":"part_missing"},{"sheet":"Module8","index":12,"reason":"part_missing"},{"sheet":"Module9","index":13,"reason":"part_missing"},{"sheet":"Module10","index":14,"reason":"part_missing"},{"sheet":"Module11","index":15,"reason":"part_missing"},{"sheet":"Module12","index":16,"reason":"part_missing"},{"sheet":"Module13","index":17,"reason":"part_missing"},{"sheet":"Module14","index":18,"reason":"part_missing"},{"sheet":"Module15","index":19,"reason":"part_missing"}],"bounds":{"document_bytes":16777216,"sheet_cells":100000,"rows_first":2000,"rows_last":500,"rows_between":2000,"halvings":0,"cell_chars":16384,"cell_head_chars":4096},"cells_cut":0,"cells_raw":0,"read":"whole","date_system":"1900"}

{"sheet":"Instructions","index":0,"n_rows":23,"n_cols":2,"rows_kept":23,"cut":false,"hidden":false,"merged":[]}
[null,"FIRST LEGO League Challenge BIOGLOW"]
[null,"Excel Scorer Instructions"]
[]
[null,"IMPORTANT: Before using, start by making an uncorrupted backup copy of this spreadsheet."]
[null,"Do not run any other spreadsheets while you run this one."]
[null,"Adjust View, Zoom, and Display Settings to arrive at a screen output that projects well."]
[null,"If you have questions, or if you discover problems concerning this spreadsheet, e-mail fllquestions@firstinspires.org."]
[null,"Save frequently during the competition to avoid loss of data."]
[]
[null,"Team Data sheet is used to enter team numbers and names.  It will automatically arrange the matches of 3 rounds on 4 fields (half-tables), in the Score Entry and Standings sheet."]
[null,"In Team Data, enter team numbers and names in the order of arrival on site, and press Enter.  If the number of teams at the tournament is not a multiple of 4, substitute teams should be found or prepared to stand in and play (for no score) as needed. Create placeholder team names and enter zeros for their scores as needed."]
[]
[null,"Scoring Worksheet sheeet is used to to tally the data from each Ref Sheet when it comes to you."]
[null,"Before the tournament, print the Ref Scoresheet (one copy per team per round, plus extras) and give them to the referees on clip boards."]
[null,"When a referee hands in a Scoresheet, click and type as needed on the Scoring Worksheet to match it exactly."]
[null,"When finished, note the score and write it in pen on the Ref Sheet.  This is a hardcopy backup system."]
[null,"Then go to Score Entry And Standings and enter the score for the correct team in the correct round."]
[null,"When using the Scoring Worksheet the next time, clear it first by clicking the RESET button."]
[]
[null,"Score Entry And Standings is the place to enter all scores from the Scoring Worksheet.  You will then use commands to make the spreadsheet break ties and show ranks."]
{"$rows_left_out":4}
{"sheet":"Team Data","index":1,"n_rows":87,"n_cols":5,"rows_kept":87,"cut":false,"hidden":false,"merged":[]}
[]
[]
[]
[]
[]
[null,"REGISTRATION"]
[null,"Team #","Team Name"]
[null,1,"T1",{"$f":"IF(B8=\"\",\"\",E8)","v":1},1]
[null,2,"T2",{"$f":"IF(B9=\"\",\"\",E9)","v":2},2]
[null,3,"T3",3,3]
[null,4,"T4",4,4]
[null,null,null,{"$f":"IF(B12=\"\",\"\",E12)","v":""},5]
[{"$f":"IF(AND(B12<>\"\",B13=\"\"),\"                      Need Substitute Teams\",\"\")","v":""},null,null,{"$f":"IF(B13=\"\",\"\",E13)","v":""},6]
[{"$f":"IF(AND(B13<>\"\",B14=\"\"),\"                      Need Substitute Teams\",\"\")","v":""},null,null,"",7]
[{"$f":"IF(AND(B14<>\"\",B15=\"\"),\"                      Need Substitute Teams\",\"\")","v":""},null,null,"",8]
[null,null,null,"",9]
[{"$f":"IF(AND(B16<>\"\",B17=\"\"),\"                      Need Substitute Teams\",\"\")","v":""},null,null,"",10]
[{"$f":"IF(AND(B17<>\"\",B18=\"\"),\"                      Need Substitute Teams\",\"\")","v":""},null,null,"",11]
[{"$f":"IF(AND(B18<>\"\",B19=\"\"),\"                      Need Substitute Teams\",\"\")","v":""},null,null,"",12]
[null,null,null,"",13]
{"$rows_left_out":68}
{"sheet":"Scoring Worksheet","index":2,"n_rows":125,"n_cols":8,"rows_kept":125,"cut":false,"hidden":false,"merged":[[29,1,32,1],[1,1,1,5],[13,1,14,1],[15,1,16,1],[18,1,20,1],[27,1,28,1]]}
[]
[null,"BIOGLOW Founders Edition - Robot Game Scoresheet",null,null,null,null,null,"****Form Control Groups are hidden via Macro"]
[null,"M##","Mission","Options"]
[null,"---","(Prematch) The robot and all equipment fit completely in one launch area \nand under the height limit:",null,{"$f":"IF(F4=\"\",\" \",IF(H4=10000,\" \",\"\"))","v":" "},null,null,{"$f":"(F4-1)*20","v":-20}]
[null,"Mission 01","The drone is no longer touching the mat:",null," ",null,null,{"$f":"(F5-1)*20","v":-20}]
[null,null,"Bonus: and the LiDAR map is completely flipped over, with the scan \nmarker at least partly in the survey area:",null," ",null,null,{"$f":"IF(F5>1,(F6-1)*10,0)","v":0}]
[null,"Mission 02","Number of seeds no longer touching the stalk: ",null," ",null,null,{"$f":"(F7-1)*10","v":-10}]
[null,"Mission 03","The research flag is down: ",null," ",null,null,{"$f":"(F8-1)*20","v":-20}]
[null,null,"Bonus: and the rock has been returned to its original starting position:",null," ",null,null,{"$f":"IF(F8>1, (F9-1)*10, 0)","v":0}]
[null,"Mission 04","Number of leaves no longer touching the nest:",null," ",null,null,{"$f":"IF(AND(F11>1,(F10>1)),10,0)","v":0}]
[null,null,"The katydid is completely in the leaf habitat: ",null," "]
[null,null,"Bonus: and the katydid remained in its original position throughout the match:",null," ",null,null,{"$f":"IF(AND(F10>2,F11>1),(F12-1)*20,0)","v":0}]
[null,"Mission 05","The plant root is extended: ",null," ",null,null,{"$f":"(F13-1)*10","v":-10}]
[null,"Mission 06","The ant is touching the nest: ",null," "]
[null,null,"Number of leaf fragments contained within the nest: ",null," ",null,null,{"$f":"IF(F14>1,(F15-1)*10,0)","v":0}]
[null,"Mission 07","The mycelium is completely extended: ",null," ",null,null,{"$f":"(F16-1)*20","v":-20}]
[null,null,"Bonus: Number of connections formed between one team’s extended mycelium \nand the opposing team’s fully extended plant root:",null," ",null,null,{"$f":"IF(F16>1,(F17-1)*10,0)","v":0}]
[null,"Mission 08","The vine is touching the mat:",null," ",null,null,{"$f":"(F18-1)*30","v":-30}]
[null,"Mission 09","The research platform is raised:",null," ",null,null,{"$f":"(F19-1)*10","v":-10}]
[null,null,"The camera trap is deployed: ",null," ",null,null,{"$f":"(F20-1)*10","v":-10}]
{"$rows_left_out":106}
{"sheet":"Score Entry And Standings","index":3,"n_rows":386,"n_cols":51,"rows_kept":386,"cut":false,"hidden":false,"merged":[[2,1,2,3],[2,4,2,6],[2,7,2,9],[2,10,2,12],[1,1,1,12],[26,1,26,12],[52,1,52,3],[52,4,52,6],[52,7,52,9],[52,10,52,12],[27,1,27,3],[27,4,27,6],[27,7,27,9],[27,10,27,12],[51,1,51,12],[4,17,4,18],[0,17,0,23],[1,17,1,23],[3,17,3,18],[2,17,2,23],[3,20,3,22]]}
[null,null,null,null,null,null,null,null,null,null,null,null,null,null,null,null,null,"control a…sorts R,S by Rasc then Sdec",null,null,null,null,null,null,null,null,null,null,null,null,null,null,null,null,null,null,null,null,null,null,null,null,null,null,null,null,null,null,null,"sortable version of"]
[null,"Round 1",null,null,null,null,null,null,null,null,null,null,null,null,null,null,null,"then sorts T,U,V,W  by Udec then Vdec then Wdec",null,null,null,null,null,null,null,"data from 16",null,null,null,null,null,"data from 8",null,null,null,null,"data from 4",null,null,null,null,"data from 2",null,null,null,"not sortable",null,null,null,"list to the left"]
[null,"Field A",null,null,"Field B",null,null,"Field C",null,null,"Field D",null,null,null,null,null,null,null,null,null,null,null,null,null,null,"control b…sorts Z,AA by AAdec",null,null,null,null,null,"control w…sorts AF,AG by AGdec",null,null,null,null,"control d…sorts AF,AG by AGdec",null,null,null,null,"control e…sorts AO,AP by APdec"]
[null,"Team","Score","Rank","Team","Score","Rank","Team","Score","Rank","Team","Score","Rank",null,null,null,null,null,null,null,"type ctrl+a first!",null,null,null,null,"takes sweet 16, returns great 8",null,null,null,null,null,"takes great 8, returns final 4",null,null,null,null,"takes final 4, returns rumble",null,null,null,null,"takes rumble, returns winners",null,null,null,null,"for rank",null,null,"for Director's"]
[null,{"$f":"IF('Team Data'!B8=\"\",\"\",'Team Data'!B8)","v":1},null,{"$f":"IF($C$5=\"\",\"\",RANK(AU6,($AU$6:$AU$85),0))","v":""},{"$f":"IF('Team Data'!B9=\"\",\"\",'Team Data'!B9)","v":2},null,{"$f":"IF($F$5=\"\",\"\",RANK(AU26,($AU$6:$AU$85),0))","v":""},{"$f":"IF('Team Data'!B10=\"\",\"\",'Team Data'!B10)","v":3},null,{"$f":"IF($I$5=\"\",\"\",RANK(AU46,($AU$6:$AU$85),0))","v":""},{"$f":"IF('Team Data'!B11=\"\",\"\",'Team Data'!B11)","v":4},null,{"$f":"IF($L$5=\"\",\"\",RANK(AU66,($AU$6:$AU$85),0))","v":""},null,null,null,"RANK","(raw data)",null,"TEAM","highest","2nd best","lowest",null,null,"team","score",null,null,null,null,"team","score",null,null,null,"team","score",null,null,null,"team","score",null,null,"team","max",null,"team","max","count"]
[null,{"$f":"IF('Team Data'!B12=\"\",\"\",'Team Data'!B12)","v":""},null,{"$f":"IF($C$6=\"\",\"\",RANK(AU7,($AU$6:$AU$85),0))","v":""},{"$f":"IF('Team Data'!B13=\"\",\"\",'Team Data'!B13)","v":""},null,{"$f":"IF($F$6=\"\",\"\",RANK(AU27,($AU$6:$AU$85),0))","v":""},{"$f":"IF('Team Data'!B14=\"\",\"\",'Team Data'!B14)","v":""},null,{"$f":"IF($I$6=\"\",\"\",RANK(AU47,($AU$6:$AU$85),0))","v":""},{"$f":"IF('Team Data'!B15=\"\",\"\",'Team Data'!B15)","v":""},null,{"$f":"IF($L$6=\"\",\"\",RANK(AU67,($AU$6:$AU$85),0))","v":""},null,null,null,"1st",{"$f":"$H$55","v":1},{"$f":"$I$55","v":0},{"$f":"$R$12","v":3},{"$f":"$S$12","v":0},{"$f":"$S$13","v":0},{"$f":"$S$14","v":0},null,null,{"$f":"$E$108","v":0},{"$f":"$F$108","v":0},null,null,null,null,{"$f":"$E$117","v":0},{"$f":"$F$117","v":0},null,null,null,{"$f":"$B$128","v":0},{"$f":"$C$128","v":0},null,null,null,{"$f":"$H$135","v":0},{"$f":"$I$135","v":0},null,null,{"$f":"B5","v":1},{"$f":"MAX(C5,F30,I55)","v":0},null,{"$f":"AT$6","v":1},{"$f":"AU$6","v":0},{"$f":"IF(AW6=\"\",\"\",1)","v":1}]
[null,{"$f":"IF('Team Data'!B16=\"\",\"\",'Team Data'!B16)","v":""},null,{"$f":"IF($C$7=\"\",\"\",RANK(AU8,($AU$6:$AU$85),0))","v":""},{"$f":"IF('Team Data'!B17=\"\",\"\",'Team Data'!B17)","v":""},null,{"$f":"IF($F$7=\"\",\"\",RANK(AU28,($AU$6:$AU$85),0))","v":""},{"$f":"IF('Team Data'!B18=\"\",\"\",'Team Data'!B18)","v":""},null,{"$f":"IF($I$7=\"\",\"\",RANK(AU48,($AU$6:$AU$85),0))","v":""},{"$f":"IF('Team Data'!B19=\"\",\"\",'Team Data'!B19)","v":""},null,{"$f":"IF($L$7=\"\",\"\",RANK(AU68,($AU$6:$AU$85),0))","v":""},null,null,null,"2nd",{"$f":"$E$30","v":1},{"$f":"$F$30","v":0},{"$f":"$R$6","v":1},{"$f":"$S$6","v":0},{"$f":"$S$7","v":0},{"$f":"$S$8","v":0},null,null,{"$f":"$H$108","v":0},{"$f":"$I$108","v":0},null,null,null,null,{"$f":"$B$119","v":0},{"$f":"$C$119","v":0},null,null,null,{"$f":"$E$128","v":0},{"$f":"$F$128","v":0},null,null,null,{"$f":"$E$135","v":0},{"$f":"$F$135","v":0},null,null,"",0,null,{"$f":"AT$26","v":2},{"$f":"AU$26","v":0},{"$f":"IF(AW7=\"\",\"\",1)","v":1}]
[null,{"$f":"IF('Team Data'!B20=\"\",\"\",'Team Data'!B20)","v":""},null,{"$f":"IF($C$8=\"\",\"\",RANK(AU9,($AU$6:$AU$85),0))","v":""},{"$f":"IF('Team Data'!B21=\"\",\"\",'Team Data'!B21)","v":""},null,{"$f":"IF($F$8=\"\",\"\",RANK(AU29,($AU$6:$AU$85),0))","v":""},{"$f":"IF('Team Data'!B22=\"\",\"\",'Team Data'!B22)","v":""},null,{"$f":"IF($I$8=\"\",\"\",RANK(AU49,($AU$6:$AU$85),0))","v":""},{"$f":"IF('Team Data'!B23=\"\",\"\",'Team Data'!B23)","v":""},null,{"$f":"IF($L$8=\"\",\"\",RANK(AU69,($AU$6:$AU$85),0))","v":""},null,null,null,"3rd",{"$f":"$B$5","v":1},{"$f":"$C$5","v":0},{"$f":"$R$15","v":4},{"$f":"$S$15","v":0},{"$f":"$S$16","v":0},{"$f":"$S$17","v":0},null,null,{"$f":"$E$110","v":0},{"$f":"$F$110","v":0},null,null,null,null,{"$f":"$B$117","v":0},{"$f":"$C$117","v":0},null,null,null,{"$f":"$K$127","v":0},{"$f":"$L$127","v":0},null,null,null,{"$f":"$E$136","v":0},{"$f":"$F$136","v":0},null,null,"",0,null,{"$f":"AT$46","v":3},{"$f":"AU$46","v":0},1]
[null,{"$f":"IF('Team Data'!B24=\"\",\"\",'Team Data'!B24)","v":""},null,{"$f":"IF($C$9=\"\",\"\",RANK(AU10,($AU$6:$AU$85),0))","v":""},{"$f":"IF('Team Data'!B25=\"\",\"\",'Team Data'!B25)","v":""},null,{"$f":"IF($F$9=\"\",\"\",RANK(AU30,($AU$6:$AU$85),0))","v":""},{"$f":"IF('Team Data'!B26=\"\",\"\",'Team Data'!B26)","v":""},null,{"$f":"IF($I$9=\"\",\"\",RANK(AU50,($AU$6:$AU$85),0))","v":""},{"$f":"IF('Team Data'!B27=\"\",\"\",'Team Data'!B27)","v":""},null,{"$f":"IF($L$9=\"\",\"\",RANK(AU70,($AU$6:$AU$85),0))","v":""},null,null,null,"4th",{"$f":"$B$55","v":2},{"$f":"$C$55","v":0},{"$f":"$R$9","v":2},{"$f":"$S$9","v":0},{"$f":"$S$10","v":0},{"$f":"$S$11","v":0},null,null,{"$f":"$K$108","v":0},{"$f":"$L$108","v":0},null,null,null,null,{"$f":"$K$118","v":0},{"$f":"$L$118","v":0},null,null,null,{"$f":"$B$127","v":0},{"$f":"$C$127","v":0},null,null,null,{"$f":"$H$136","v":0},{"$f":"$I$136","v":0},null,null,"",0,null,{"$f":"AT$66","v":4},{"$f":"AU$66","v":0},1]
[null,{"$f":"IF('Team Data'!B28=\"\",\"\",'Team Data'!B28)","v":""},null,{"$f":"IF($C$10=\"\",\"\",RANK(AU11,($AU$6:$AU$85),0))","v":""},{"$f":"IF('Team Data'!B29=\"\",\"\",'Team Data'!B29)","v":""},null,{"$f":"IF($F$10=\"\",\"\",RANK(AU31,($AU$6:$AU$85),0))","v":""},{"$f":"IF('Team Data'!B30=\"\",\"\",'Team Data'!B30)","v":""},null,{"$f":"IF($I$10=\"\",\"\",RANK(AU51,($AU$6:$AU$85),0))","v":""},{"$f":"IF('Team Data'!B31=\"\",\"\",'Team Data'!B31)","v":""},null,{"$f":"IF($L$10=\"\",\"\",RANK(AU71,($AU$6:$AU$85),0))","v":""},null,null,null,"5th",{"$f":"$H$30","v":2},{"$f":"$I$30","v":0},{"$f":"$R$27","v":""},{"$f":"$S$27","v":0},{"$f":"$S$28","v":0},{"$f":"$S$29","v":0},null,null,{"$f":"$K$107","v":0},{"$f":"$L$107","v":0},null,null,null,null,{"$f":"$H$118","v":0},{"$f":"$I$118","v":0},null,null,null,{"$f":"$E$127","v":0},{"$f":"$F$127","v":0},null,null,null,null,null,null,null,"",0,null,{"$f":"AT$7","v":""},{"$f":"AU$7","v":0},""]
[null,{"$f":"IF('Team Data'!B32=\"\",\"\",'Team Data'!B32)","v":""},null,{"$f":"IF($C$11=\"\",\"\",RANK(AU12,($AU$6:$AU$85),0))","v":""},{"$f":"IF('Team Data'!B33=\"\",\"\",'Team Data'!B33)","v":""},null,{"$f":"IF($F$11=\"\",\"\",RANK(AU32,($AU$6:$AU$85),0))","v":""},{"$f":"IF('Team Data'!B34=\"\",\"\",'Team Data'!B34)","v":""},null,{"$f":"IF($I$11=\"\",\"\",RANK(AU52,($AU$6:$AU$85),0))","v":""},{"$f":"IF('Team Data'!B35=\"\",\"\",'Team Data'!B35)","v":""},null,{"$f":"IF($L$11=\"\",\"\",RANK(AU72,($AU$6:$AU$85),0))","v":""},null,null,null,"6th",{"$f":"$E$5","v":2},{"$f":"$F$5","v":0},{"$f":"$R$24","v":""},{"$f":"$S$24","v":0},{"$f":"$S$25","v":0},{"$f":"$S$26","v":0},null,null,{"$f":"$E$107","v":0},{"$f":"$F$107","v":0},null,null,null,null,{"$f":"$E$118","v":0},{"$f":"$F$118","v":0},null,null,null,{"$f":"$H$127","v":0},{"$f":"$I$127","v":0},null,null,null,null,null,null,null,"",0,null,{"$f":"AT$27","v":""},{"$f":"AU$27","v":0},""]
[null,{"$f":"IF('Team Data'!B36=\"\",\"\",'Team Data'!B36)","v":""},null,{"$f":"IF($C$12=\"\",\"\",RANK(AU13,($AU$6:$AU$85),0))","v":""},{"$f":"IF('Team Data'!B37=\"\",\"\",'Team Data'!B37)","v":""},null,{"$f":"IF($F$12=\"\",\"\",RANK(AU33,($AU$6:$AU$85),0))","v":""},{"$f":"IF('Team Data'!B38=\"\",\"\",'Team Data'!B38)","v":""},null,{"$f":"IF($I$12=\"\",\"\",RANK(AU53,($AU$6:$AU$85),0))","v":""},{"$f":"IF('Team Data'!B39=\"\",\"\",'Team Data'!B39)","v":""},null,{"$f":"IF($L$12=\"\",\"\",RANK(AU73,($AU$6:$AU$85),0))","v":""},null,null,null,"7th",{"$f":"$K$55","v":3},{"$f":"$L$55","v":0},{"$f":"$R$21","v":""},{"$f":"$S$21","v":0},{"$f":"$S$22","v":0},{"$f":"$S$23","v":0},null,null,{"$f":"$B$108","v":0},{"$f":"$C$108","v":0},null,null,null,null,{"$f":"$H$117","v":0},{"$f":"$I$117","v":0},null,null,null,{"$f":"$K$128","v":0},{"$f":"$L$128","v":0},null,null,null,null,null,null,null,"",0,null,{"$f":"AT$47","v":""},{"$f":"AU$47","v":0},""]
[null,{"$f":"IF('Team Data'!B40=\"\",\"\",'Team Data'!B40)","v":""},null,{"$f":"IF($C$13=\"\",\"\",RANK(AU14,($AU$6:$AU$85),0))","v":""},{"$f":"IF('Team Data'!B41=\"\",\"\",'Team Data'!B41)","v":""},null,{"$f":"IF($F$13=\"\",\"\",RANK(AU34,($AU$6:$AU$85),0))","v":""},{"$f":"IF('Team Data'!B42=\"\",\"\",'Team Data'!B42)","v":""},null,{"$f":"IF($I$13=\"\",\"\",RANK(AU54,($AU$6:$AU$85),0))","v":""},{"$f":"IF('Team Data'!B43=\"\",\"\",'Team Data'!B43)","v":""},null,{"$f":"IF($L$13=\"\",\"\",RANK(AU74,($AU$6:$AU$85),0))","v":""},null,null,null,"8th",{"$f":"$K$30","v":3},{"$f":"$L$30","v":0},{"$f":"$R$18","v":""},{"$f":"$S$18","v":0},{"$f":"$S$19","v":0},{"$f":"$S$20","v":0},null,null,{"$f":"$B$107","v":0},{"$f":"$C$107","v":0},null,null,null,null,{"$f":"B$118","v":0},{"$f":"$C$118","v":0},null,null,null,{"$f":"$H$128","v":0},{"$f":"$I$128","v":0},null,null,null,null,null,null,null,"",0,null,{"$f":"AT$67","v":""},{"$f":"AU$67","v":0},""]
[null,{"$f":"IF('Team Data'!B44=\"\",\"\",'Team Data'!B44)","v":""},null,{"$f":"IF($C$14=\"\",\"\",RANK(AU15,($AU$6:$AU$85),0))","v":""},{"$f":"IF('Team Data'!B45=\"\",\"\",'Team Data'!B45)","v":""},null,{"$f":"IF($F$14=\"\",\"\",RANK(AU35,($AU$6:$AU$85),0))","v":""},{"$f":"IF('Team Data'!B46=\"\",\"\",'Team Data'!B46)","v":""},null,{"$f":"IF($I$14=\"\",\"\",RANK(AU55,($AU$6:$AU$85),0))","v":""},{"$f":"IF('Team Data'!B47=\"\",\"\",'Team Data'!B47)","v":""},null,{"$f":"IF($L$14=\"\",\"\",RANK(AU75,($AU$6:$AU$85),0))","v":""},null,null,null,"9th",{"$f":"$H$5","v":3},{"$f":"$I$5","v":0},{"$f":"$R$36","v":""},{"$f":"$S$36","v":0},{"$f":"$S$37","v":0},{"$f":"$S$38","v":0},null,null,{"$f":"$B$109","v":0},{"$f":"$C$109","v":0},null,null,null,null,{"$f":"$K$117","v":0},{"$f":"$L$117","v":0},null,null,null,null,null,null,null,null,null,null,null,null,"",0,null,{"$f":"AT$8","v":""},{"$f":"AU$8","v":0},""]
[null,{"$f":"IF('Team Data'!B48=\"\",\"\",'Team Data'!B48)","v":""},null,{"$f":"IF($C$15=\"\",\"\",RANK(AU16,($AU$6:$AU$85),0))","v":""},{"$f":"IF('Team Data'!B49=\"\",\"\",'Team Data'!B49)","v":""},null,{"$f":"IF($F$15=\"\",\"\",RANK(AU36,($AU$6:$AU$85),0))","v":""},{"$f":"IF('Team Data'!B50=\"\",\"\",'Team Data'!B50)","v":""},null,{"$f":"IF($I$15=\"\",\"\",RANK(AU56,($AU$6:$AU$85),0))","v":""},{"$f":"IF('Team Data'!B51=\"\",\"\",'Team Data'!B51)","v":""},null,{"$f":"IF($L$15=\"\",\"\",RANK(AU76,($AU$6:$AU$85),0))","v":""},null,null,null,"10th",{"$f":"$E$55","v":4},{"$f":"$F$55","v":0},{"$f":"$R$30","v":""},{"$f":"$S$30","v":0},{"$f":"$S$31","v":0},{"$f":"$S$32","v":0},null,null,{"$f":"$H$107","v":0},{"$f":"$I$107","v":0},null,null,null,null,{"$f":"$H$119","v":0},{"$f":"$I$119","v":0},null,null,null,null,null,null,null,null,null,null,null,null,"",0,null,{"$f":"AT$28","v":""},{"$f":"AU$28","v":0},""]
[null,{"$f":"IF('Team Data'!B52=\"\",\"\",'Team Data'!B52)","v":""},null,{"$f":"IF($C$16=\"\",\"\",RANK(AU17,($AU$6:$AU$85),0))","v":""},{"$f":"IF('Team Data'!B53=\"\",\"\",'Team Data'!B53)","v":""},null,{"$f":"IF($F$16=\"\",\"\",RANK(AU37,($AU$6:$AU$85),0))","v":""},{"$f":"IF('Team Data'!B54=\"\",\"\",'Team Data'!B54)","v":""},null,{"$f":"IF($I$16=\"\",\"\",RANK(AU57,($AU$6:$AU$85),0))","v":""},{"$f":"IF('Team Data'!B55=\"\",\"\",'Team Data'!B55)","v":""},null,{"$f":"IF($L$16=\"\",\"\",RANK(AU77,($AU$6:$AU$85),0))","v":""},null,null,null,"11th",{"$f":"$B$30","v":4},{"$f":"$C$30","v":0},{"$f":"$R$33","v":""},{"$f":"$S$33","v":0},{"$f":"$S$34","v":0},{"$f":"$S$35","v":0},null,null,{"$f":"$E$109","v":0},{"$f":"$F$109","v":0},null,null,null,null,{"$f":"$E$119","v":0},{"$f":"$F$119","v":0},null,null,null,null,null,null,null,null,null,null,null,null,"",0,null,{"$f":"AT$48","v":""},{"$f":"AU$48","v":0},""]
[null,{"$f":"IF('Team Data'!B56=\"\",\"\",'Team Data'!B56)","v":""},null,{"$f":"IF($C$17=\"\",\"\",RANK(AU18,($AU$6:$AU$85),0))","v":""},{"$f":"IF('Team Data'!B57=\"\",\"\",'Team Data'!B57)","v":""},null,{"$f":"IF($F$17=\"\",\"\",RANK(AU38,($AU$6:$AU$85),0))","v":""},{"$f":"IF('Team Data'!B58=\"\",\"\",'Team Data'!B58)","v":""},null,{"$f":"IF($I$17=\"\",\"\",RANK(AU58,($AU$6:$AU$85),0))","v":""},{"$f":"IF('Team Data'!B59=\"\",\"\",'Team Data'!B59)","v":""},null,{"$f":"IF($L$17=\"\",\"\",RANK(AU78,($AU$6:$AU$85),0))","v":""},null,null,null,"12th",{"$f":"$K$5","v":4},{"$f":"$L$5","v":0},{"$f":"$R$39","v":""},{"$f":"$S$39","v":0},{"$f":"$S$40","v":0},{"$f":"$S$41","v":0},null,null,{"$f":"$K$109","v":0},{"$f":"$L$109","v":0},null,null,null,null,{"$f":"$E$120","v":0},{"$f":"$F$120","v":0},null,null,null,null,null,null,null,null,null,null,null,null,"",0,null,{"$f":"AT$68","v":""},{"$f":"AU$68","v":0},""]
[null,{"$f":"IF('Team Data'!B60=\"\",\"\",'Team Data'!B60)","v":""},null,{"$f":"IF($C$18=\"\",\"\",RANK(AU19,($AU$6:$AU$85),0))","v":""},{"$f":"IF('Team Data'!B61=\"\",\"\",'Team Data'!B61)","v":""},null,{"$f":"IF($F$18=\"\",\"\",RANK(AU39,($AU$6:$AU$85),0))","v":""},{"$f":"IF('Team Data'!B62=\"\",\"\",'Team Data'!B62)","v":""},null,{"$f":"IF($I$18=\"\",\"\",RANK(AU59,($AU$6:$AU$85),0))","v":""},{"$f":"IF('Team Data'!B63=\"\",\"\",'Team Data'!B63)","v":""},null,{"$f":"IF($L$18=\"\",\"\",RANK(AU79,($AU$6:$AU$85),0))","v":""},null,null,null,"13th",{"$f":"$B$6","v":""},{"$f":"$C$6","v":0},{"$f":"$R$204","v":""},{"$f":"$S$204","v":0},{"$f":"$S$205","v":0},{"$f":"$S$206","v":0},null,null,{"$f":"$K$110","v":0},{"$f":"$L$110","v":0},null,null,null,null,{"$f":"$H$120","v":0},{"$f":"$I$120","v":0},null,null,null,null,null,null,null,null,null,null,null,null,"",0,null,{"$f":"AT$9","v":""},{"$f":"AU$9","v":0},""]
[null,{"$f":"IF('Team Data'!B64=\"\",\"\",'Team Data'!B64)","v":""},null,{"$f":"IF($C$19=\"\",\"\",RANK(AU20,($AU$6:$AU$85),0))","v":""},{"$f":"IF('Team Data'!B65=\"\",\"\",'Team Data'!B65)","v":""},null,{"$f":"IF($F$19=\"\",\"\",RANK(AU40,($AU$6:$AU$85),0))","v":""},{"$f":"IF('Team Data'!B66=\"\",\"\",'Team Data'!B66)","v":""},null,{"$f":"IF($I$19=\"\",\"\",RANK(AU60,($AU$6:$AU$85),0))","v":""},{"$f":"IF('Team Data'!B67=\"\",\"\",'Team Data'!B67)","v":""},null,{"$f":"IF($L$19=\"\",\"\",RANK(AU80,($AU$6:$AU$85),0))","v":""},null,null,null,"14th",{"$f":"$H$56","v":""},{"$f":"$I$56","v":0},{"$f":"$R$192","v":""},{"$f":"$S$192","v":0},{"$f":"$S$193","v":0},{"$f":"$S$194","v":0},null,null,{"$f":"$B$110","v":0},{"$f":"$C$110","v":0},null,null,null,null,{"$f":"$K$119","v":0},{"$f":"$L$119","v":0},null,null,null,null,null,null,null,null,null,null,null,null,"",0,null,{"$f":"AT$29","v":""},{"$f":"AU$29","v":0},""]
[null,{"$f":"IF('Team Data'!B68=\"\",\"\",'Team Data'!B68)","v":""},null,{"$f":"IF($C$20=\"\",\"\",RANK(AU21,($AU$6:$AU$85),0))","v":""},{"$f":"IF('Team Data'!B69=\"\",\"\",'Team Data'!B69)","v":""},null,{"$f":"IF($F$20=\"\",\"\",RANK(AU41,($AU$6:$AU$85),0))","v":""},{"$f":"IF('Team Data'!B70=\"\",\"\",'Team Data'!B70)","v":""},null,{"$f":"IF($I$20=\"\",\"\",RANK(AU61,($AU$6:$AU$85),0))","v":""},{"$f":"IF('Team Data'!B71=\"\",\"\",'Team Data'!B71)","v":""},null,{"$f":"IF($L$20=\"\",\"\",RANK(AU81,($AU$6:$AU$85),0))","v":""},null,null,null,"15th",{"$f":"$E$31","v":""},{"$f":"$F$31","v":0},{"$f":"$R$162","v":""},{"$f":"$S$162","v":0},{"$f":"$S$163","v":0},{"$f":"$S$164","v":0},null,null,{"$f":"$H$109","v":0},{"$f":"$I$109","v":0},null,null,null,null,{"$f":"$B$120","v":0},{"$f":"$C$120","v":0},null,null,null,null,null,null,null,null,null,null,null,null,"",0,null,{"$f":"AT$49","v":""},{"$f":"AU$49","v":0},""]
{"$rows_left_out":367}
{"sheet":"Ref Scoresheet","index":4,"n_rows":4,"n_cols":2,"rows_kept":4,"cut":false,"hidden":false,"merged":[]}
[null,"FIRST LEGO League Challenge BIOGLOW"]
[]
[null,"Printable Scoresheet"]
[null,"Click on the web link below to download and print the BIOGLOW Software Scorehseet. Printable Scorehseets can be found on the Season Resources Page under FLL Challenge > Judging and Scoring Materials."]